{"text_format":"1","workbook":"xlsx","n_sheets":12,"sheets":["Dt","General","Resumen","Estado_del_arte","Objetivos","Metodología","Cronograma","Productos","Integrantes","Presupuesto","Impactos","Bibliografía"],"not_rendered":{"charts":0,"images":1,"macros":1,"external_links":0,"defined_names":49,"comments":5,"pivot_tables":0},"unopened":[],"bounds":{"document_bytes":16777216,"sheet_cells":100000,"rows_first":2000,"rows_last":500,"rows_between":2000,"halvings":0,"cell_chars":16384,"cell_head_chars":4096},"cells_cut":0,"cells_raw":0,"read":"whole","date_system":"1900"}

{"sheet":"Dt","index":0,"n_rows":2004,"n_cols":648,"rows_kept":2004,"cut":false,"hidden":true,"merged":[]}
[null,"No eliminar Hoja … :)))",null,null,null,null,null,null,null,null,null,null,null,null,null,null,null,null,null,null,null,null,null,null,null,null,"No","Campo ","1_Opcion","2_Opcion",null,"Avaya1719",null,null,null,null,null,null,null,null,null,null,"http://scienti.colciencias.gov.co:8080/gruplac/jsp/visualiza/visualizagr.jsp?nro="]
[null,null,null,null,null,null,null,null,null,null,null,null,null,null,null,null,null,null,null,null,null,null,null,null,null,null,1,"Sedes","Calle 100",null,null,null,null,null,null,null,null,null,null,null,null,null,null,null,null,"BB",null,{"$f":"MIN(BD3:BD300)","v":4},{"$f":"MAX(BD3:BD300)","v":300}]
[null,null,null,null," ",null,null,null,null,null,null,null,null,null,null,null,null,null,null,null,null,null,null,null,null,null,2,"Sedes","Campus Cajica",null,null,null,null,null,null,null,null,null,null,"Hoja","FAC","Grupo","COD","Clas","Link","Lineas","Fila Grupo","Min","Max"," ",null,null,"COD","Lineas","Cel","Fila",null,null,"Código de Grupo",null,null,null,null,"Hora","Agente","Agente"]
[null,null,null,null,null,null,null,null,null,null,null,null,null,null,null,null,null,null,null,null,null,null,null,null,null,null,3,"Sedes","Medicina",null,null,null,null,null,null,null,null,1,{"$f":"COUNTIF($AN$4:$AN$78,AL4)","v":1},3,"CIAS","Fitoplasmas y Virus","COL0028687","C","http://scienti.colciencias.gov.co:8080/gruplac/jsp/visualiza/visualizagr.jsp?nro=00000000008436",{"$f":"$AT$2&AV4&\":\"&$AT$2&AW4","v":"BB10:BB10"},{"$f":"ROW()","v":4},{"$f":"MINA(IF(AQ4=$BA$4:$BA$300,$BD$4:$BD$300))","v":10},{"$f":"MAXA(IF(AQ4=$BA$4:$BA$300,$BD$4:$BD$300))","v":10}," ",null,null,"COL0049659","Medios de comunicación, educación y salud",1,{"$f":"ROW()","v":4},null,null,"COL0015722",{"$f":"COUNTIF($AQ$4:$AQ$78,BG4)","v":1},null,null,null,"19:54:00","a","a",{"$f":"DMIN(BL3:BM12,\"hora\",BN3:BN4)","v":0.4548611111111111},"|"]
[null,null,null,null,null,null,null,null,null,null,null,null,null,null,null,null,null,null,null,null,null,null,null,null,null,null,4,"Sedes","Otros",null,null,null,null,null,null,null,null,2,1,4,"CIAS","Grupo de investigación en Biodiversidad y ecología de abejas silvestres","COL0031959","B","http://scienti.colciencias.gov.co:8080/gruplac/jsp/visualiza/visualizagr.jsp?nro=00000000001366",{"$f":"$AT$2&AV5&\":\"&$AT$2&AW5","v":"BB11:BB15"},{"$f":"ROW()","v":5},{"$f":"MINA(IF(AQ5=$BA$4:$BA$300,$BD$4:$BD$300))","v":11},{"$f":"MAXA(IF(AQ5=$BA$4:$BA$300,$BD$4:$BD$300))","v":15}," ",null,null,"COL0049659","Salud Pública y Nutrición, Prevención de la Enfermedad y Promoción de la Salud",2,{"$f":"ROW()","v":5},null,null,"COL0026486",1,null,null,null,"09:54:00","b","B"]
[null,null,null,null,null,null,null,null,null,null,null,null,null,null,null,null,null,null,null,null,null,null,null,null,null,null,1,"Facultad","Ciencias Básicas","CIAS",null,null,null,null,null,null,null,3,1,12,"CIAS","MATRIX","COL0039321","C","http://scienti.colciencias.gov.co:8080/gruplac/jsp/visualiza/visualizagr.jsp?nro=00000000002208","BB42:BB46",{"$f":"ROW()","v":6},{"$f":"MINA(IF(AQ6=$BA$4:$BA$300,$BD$4:$BD$300))","v":42},{"$f":"MAXA(IF(AQ6=$BA$4:$BA$300,$BD$4:$BD$300))","v":46}," ",null,null,"COL0062704","Procesos Organizacionales (Prospectiva de las Organizaciones), Programáticos y Políticos para la Promoción del Desarrollo.",1,{"$f":"ROW()","v":6},null,null,"COL0027367",1,null,null,null,"17:54:00","c","c"]
[null,null,null,null,null,null,null,null,null,null,null,null,null,null,null,null,null,null,null,null,null,null,null,null,null,null,2,"Facultad","Ciencias Económicas","ECO",null,null,null,null,null,null,null,4,1,18,"CIAS","Desarrollo e integración de estrategias alternativas para la protección de cultivos de importancia económica, con énfasis en control biológico.","COL0032278","B","http://scienti.colciencias.gov.co:8080/gruplac/jsp/visualiza/visualizagr.jsp?nro=00000000001399","BB65:BB66",{"$f":"ROW()","v":7},{"$f":"MINA(IF(AQ7=$BA$4:$BA$300,$BD$4:$BD$300))","v":65},{"$f":"MAXA(IF(AQ7=$BA$4:$BA$300,$BD$4:$BD$300))","v":66}," ",null,null,"COL0062704","Prospectiva de las Organizaciones",2,{"$f":"ROW()","v":7},null,null,"COL0018448",1,null,null,null,"10:55:00","a"]
[null,null,null,null,null,null,null,null,null,null,null,null,null,null,null,null,null,null,null,null,null,null,null,null,null,null,3,"Facultad","Derecho","DER",null,null,null,null,null,null,null,5,1,26,"CIAS","Grupo de Micología y Fitopatologia ","COL0013719","A1","http://scienti.colciencias.gov.co:8080/gruplac/jsp/visualiza/visualizagr.jsp?nro=00000000001127","BB107:BB111",{"$f":"ROW()","v":8},{"$f":"MINA(IF(AQ8=$BA$4:$BA$300,$BD$4:$BD$300))","v":107},{"$f":"MAXA(IF(AQ8=$BA$4:$BA$300,$BD$4:$BD$300))","v":111}," ",null,null,"COL0062704","Responsabilidad Ambiental",3,{"$f":"ROW()","v":8},null,null,"COL0028767",1,null,null,null,"11:45:00","a"]
[null,null,null,null,null,null,null,null,null,null,null,null,null,null,null,null,null,null,null,null,null,null,null,null,null,null,4,"Facultad","Educación y Humanidades","HUM",null,null,null,null,null,null,null,6,1,28,"CIAS","Fitopatologia molecular","COL0086179","C","http://scienti.colciencias.gov.co:8080/gruplac/jsp/visualiza/visualizagr.jsp?nro=00000000007907","BB118:BB120",{"$f":"ROW()","v":9},{"$f":"MINA(IF(AQ9=$BA$4:$BA$300,$BD$4:$BD$300))","v":118},{"$f":"MAXA(IF(AQ9=$BA$4:$BA$300,$BD$4:$BD$300))","v":120}," ",null,null,"COL0062704","Responsabilidad Social Empresarial",4,{"$f":"ROW()","v":9},null,null,"COL0028918",1,null,null,null,"15:12:00","b"]
[null,null,null,null,null,null,null,null,null,null,null,null,null,null,null,null,null,null,null,null,null,null,null,null,null,null,5,"Facultad","Estudios a Distancia","DIS",null,null,null,null,null,null,null,7,1,30,"CIAS","Estadística, Control y Optimización","COL0136423","C","http://scienti.colciencias.gov.co:8080/gruplac/jsp/visualiza/visualizagr.jsp?nro=00000000013845","BB125:BB129",{"$f":"ROW()","v":10},{"$f":"MINA(IF(AQ10=$BA$4:$BA$300,$BD$4:$BD$300))","v":125},{"$f":"MAXA(IF(AQ10=$BA$4:$BA$300,$BD$4:$BD$300))","v":129}," ",null,null,"COL0028687","Fitoplasmas",1,{"$f":"ROW()","v":10},null,null,"COL0031824",1,null,null,null,"23:12:00","b"]
{"$rows_left_out":1995}
{"sheet":"General","index":1,"n_rows":44,"n_cols":24,"rows_kept":44,"cut":false,"hidden":false,"merged":[[41,1,41,8],[29,2,29,8],[32,2,32,8],[17,2,17,8],[19,3,19,8],[21,2,21,8],[23,3,23,8],[25,2,25,8],[30,2,30,6],[31,2,31,6],[15,3,15,8],[11,2,11,5],[11,7,11,8],[1,1,2,6],[8,1,8,8],[9,2,9,5],[9,7,9,8],[10,7,10,8],[10,2,10,5],[6,2,6,5],[6,7,6,8]]}
[1,null,null,null,null,null,null,{"$f":"IFERROR(VLOOKUP($C$7,Dt!AD79:AE80,2,0),\"INV\")","v":"INV"},{"$f":"IFERROR(VLOOKUP($C$12,Dt!$AC$6:$AD$13,2,0),\"NT\")","v":"NT"},null,null,null,null,7,"A",{"$f":"COUNTIF($I$17:$I$25,O1)","v":0},{"$f":"IF(P1>0,$N1,0)","v":0},null,null,null,null,null,null,"Número de Paginas del documento final , se puede ajustar."]
[null,"PRESENTACIÓN DE PROYECTOS \nDE INVESTIGACIÓN",null,null,null,null,null,"Fecha de Emisión: 2017/02/28","IN-IV-F-14",null,null,null,null,6,"A1",{"$f":"COUNTIF($I$17:$I$25,O2)","v":0},0,null,null,null,null,null,null,11]
[null,null,null,null,null,null,null,"Revision N°:\n2",{"$f":"\"Página \"&A1&\" de \"&Dt_TPG","v":"Página 1 de 11"},null,null,null,null,5,"B",0,0,null,"Investigación Científica"]
[null,null,null,null,null,null,null,null,null,null,null,null,null,null,null,0,0]
["1.-","Información general del proyecto.",null,null,null,null,null,null,null,null,null,null,null,4,"C",0,0,null,null,null,null,null,null,"Hoy es "]
[null,null,null,null,null,null,null,null,null,null,null,null,null,null,null,0,0]
[null,"Convocatoria:","Investigación Científica",null,null,null,null,null,null,null,null,null,null,3,"D",0,0,null,null,null,null,null,null,{"$f":"NOW()","v":"2017-03-21T09:44:58.680"}]
[null,null,null,null,null,null,null,null,null,null,null,null,null,2,"R",0,0]
[null,null,null,null,null,null,null,null,null,null,null,null,null,1,"NR",0,0]
[null,"Líder: ",null,null,null,null,"Teléfonos :",null,null,null,null,null,null,null,null,null,null,null,null,null,null,null,null,"2017-03-02"]
{"$rows_left_out":35}
{"sheet":"Resumen","index":2,"n_rows":32,"n_cols":9,"rows_kept":32,"cut":false,"hidden":false,"merged":[[25,2,25,4],[26,2,26,4],[27,2,27,4],[28,2,28,4],[20,2,20,4],[21,2,21,4],[22,2,22,4],[23,2,23,4],[24,2,24,4],[8,2,8,4],[7,2,7,4],[1,2,2,2],[6,2,6,4],[19,2,19,4],[13,2,13,4],[12,2,12,4],[11,2,11,4],[10,2,10,4],[9,2,9,4]]}
[2,null,null,null,null,null,"*Pueden  Ocultar las Filas que no se utilicen."]
[null,null,"PRESENTACIÓN DE PROYECTOS \nDE INVESTIGACIÓN",{"$f":"General!$H$2","v":"Fecha de Emisión: 2017/02/28"},{"$f":"General!$I$2","v":"IN-IV-F-14"},null,{"$f":"SUM(G7:G14)","v":0},"<=== N° palabras en total"]
[null,null,null,{"$f":"General!$H$3","v":"Revision N°:\n2"},{"$f":"\"Página \"&A1&\" de \"&Dt_TPG","v":"Página 2 de 11"},null,"Palabras","Largo L","Limite"]
[]
["4.-","#","Resumen de la propuesta .( 250 Palabras)",null,null,null,{"$f":"SUM(G6:G15)","v":0},{"$f":"SUM(H6:H15)","v":0},250]
[null,null,null,null,null,null,null,null,{"$f":"I5","v":250}]
[null,{"$f":"ROW()-6","v":1},null,null,null,null,{"$f":"IF(C7=\"\",0,LEN(TRIM(C7))-LEN(SUBSTITUTE(TRIM(C7),\" \",\"\"))+1)","v":0},{"$f":"LEN(C7)","v":0},{"$f":"I6","v":250}]
[null,{"$f":"ROW()-6","v":2},null,null,null,null,{"$f":"IF(C8=\"\",0,LEN(TRIM(C8))-LEN(SUBSTITUTE(TRIM(C8),\" \",\"\"))+1)","v":0},{"$f":"LEN(C8)","v":0},250]
[null,3,null,null,null,null,{"$f":"IF(C9=\"\",0,LEN(TRIM(C9))-LEN(SUBSTITUTE(TRIM(C9),\" \",\"\"))+1)","v":0},0,250]
[null,4,null,null,null,null,0,0,250]
{"$rows_left_out":23}
{"sheet":"Estado_del_arte","index":3,"n_rows":40,"n_cols":8,"rows_kept":40,"cut":false,"hidden":false,"merged":[[35,2,35,4],[1,2,2,2],[30,2,30,4],[31,2,31,4],[32,2,32,4],[33,2,33,4],[18,2,18,4],[19,2,19,4],[20,2,20,4],[21,2,21,4],[22,2,22,4],[23,2,23,4],[12,2,12,4],[13,2,13,4],[14,2,14,4],[15,2,15,4],[16,2,16,4],[34,2,34,4],[24,2,24,4],[25,2,25,4],[26,2,26,4],[27,2,27,4],[28,2,28,4],[29,2,29,4],[17,2,17,4],[11,2,11,4],[6,2,6,4],[7,2,7,4],[8,2,8,4],[9,2,9,4],[10,2,10,4]]}
[3,null,null,null,null,null,"*Pueden  Ocultar las Filas que no se utilicen."]
[null,null,"PRESENTACIÓN DE PROYECTOS \nDE INVESTIGACIÓN",{"$f":"General!$H$2","v":"Fecha de Emisión: 2017/02/28"},{"$f":"General!$I$2","v":"IN-IV-F-14"}]
[null,null,null,{"$f":"General!$H$3","v":"Revision N°:\n2"},{"$f":"\"Página \"&A1&\" de \"&Dt_TPG","v":"Página 3 de 11"},null,{"$f":"SUM(G7:G3500)","v":0},"<== Total de palabras"]
[]
["6.-","#","Estado del arte de la propuesta o  antecedesntes.",null,null,null,"Largo"]
[]
[null,{"$f":"ROW()-6","v":1},null,null,null,null,{"$f":"IF(C7=\"\",0,LEN(TRIM(C7))-LEN(SUBSTITUTE(TRIM(C7),\" \",\"\"))+1)","v":0}]
[null,{"$f":"ROW()-6","v":2},null,null,null,null,{"$f":"IF(C8=\"\",0,LEN(TRIM(C8))-LEN(SUBSTITUTE(TRIM(C8),\" \",\"\"))+1)","v":0}]
[null,3,null,null,null,null,0]
[null,4,null,null,null,null,0]
{"$rows_left_out":31}
{"sheet":"Objetivos","index":4,"n_rows":23,"n_cols":8,"rows_kept":23,"cut":false,"hidden":false,"merged":[[18,2,18,4],[17,2,17,4],[22,2,22,4],[21,2,21,4],[20,2,20,4],[19,2,19,4],[1,1,2,2],[7,2,7,4],[8,2,8,4],[9,2,9,4],[10,2,10,4],[6,1,6,4],[11,2,11,4],[13,2,13,4],[14,2,14,4],[15,2,15,4],[16,2,16,4],[12,2,12,4]]}
[4]
[null,"PRESENTACIÓN DE PROYECTOS \nDE INVESTIGACIÓN",null,{"$f":"General!$H$2","v":"Fecha de Emisión: 2017/02/28"},{"$f":"General!$I$2","v":"IN-IV-F-14"}]
[null,null,null,{"$f":"General!$H$3","v":"Revision N°:\n2"},{"$f":"\"Página \"&A1&\" de \"&Dt_TPG","v":"Página 4 de 11"},null,{"$f":"SUM(G7:G3500)","v":0},"<== Total de palabras"]
[]
["7.-","Objetivos de la propuesta.",null,null,null,null,"Largo"]
[]
[null,"*El especio del Item (0) Cero es para definir el objetivo general los demás corresponden a objetivos especificos "]
[null,{"$f":"ROW()-8","v":0},null,null,null,null,{"$f":"IF(C8=\"\",0,LEN(TRIM(C8))-LEN(SUBSTITUTE(TRIM(C8),\" \",\"\"))+1)","v":0}]
[null,{"$f":"ROW()-8","v":1},null,null,null,null,0]
[null,2,null,null,null,null,0]
{"$rows_left_out":14}
{"sheet":"Metodología","index":5,"n_rows":40,"n_cols":8,"rows_kept":40,"cut":false,"hidden":false,"merged":[[30,2,30,4],[31,2,31,4],[32,2,32,4],[33,2,33,4],[34,2,34,4],[1,2,2,2],[24,2,24,4],[25,2,25,4],[26,2,26,4],[27,2,27,4],[12,2,12,4],[13,2,13,4],[14,2,14,4],[15,2,15,4],[16,2,16,4],[17,2,17,4],[6,2,6,4],[7,2,7,4],[8,2,8,4],[9,2,9,4],[10,2,10,4],[11,2,11,4],[28,2,28,4],[29,2,29,4],[18,2,18,4],[19,2,19,4],[20,2,20,4],[21,2,21,4],[22,2,22,4],[23,2,23,4]]}
[5,null,null,null,null,null,"*Pueden  Ocultar las Filas que no se utilicen."]
[null,null,"PRESENTACIÓN DE PROYECTOS \nDE INVESTIGACIÓN",{"$f":"General!$H$2","v":"Fecha de Emisión: 2017/02/28"},{"$f":"General!$I$2","v":"IN-IV-F-14"}]
[null,null,null,{"$f":"General!$H$3","v":"Revision N°:\n2"},{"$f":"\"Página \"&A1&\" de \"&Dt_TPG","v":"Página 5 de 11"},null,{"$f":"SUM(G7:G3500)","v":0},"<== Total de palabras"]
[]
["8.-","#","Metodología de la propuesta.",null,null,null,"Largo"]
[]
[null,{"$f":"ROW()-6","v":1},null,null,null,null,{"$f":"IF(C7=\"\",0,LEN(TRIM(C7))-LEN(SUBSTITUTE(TRIM(C7),\" \",\"\"))+1)","v":0}]
[null,{"$f":"ROW()-6","v":2},null,null,null,null,{"$f":"IF(C8=\"\",0,LEN(TRIM(C8))-LEN(SUBSTITUTE(TRIM(C8),\" \",\"\"))+1)","v":0}]
[null,3,null,null,null,null,0]
[null,4,null,null,null,null,0]
{"$rows_left_out":31}
{"sheet":"Cronograma","index":6,"n_rows":33,"n_cols":12,"rows_kept":33,"cut":false,"hidden":false,"merged":[[1,1,2,2]]}
[6,null,null,null,null,null,null,null,"*Pueden  Ocultar las Filas que no se utilicen.",null,null,{"$f":"(\"* Actualmente tiene \"&G7&\" meses de ejecución no superar los \"& G5&\" meses.\")","v":"* Actualmente tiene 0 meses de ejecución no superar los 12 meses."}]
[null,"PRESENTACIÓN DE PROYECTOS \nDE INVESTIGACIÓN",null,{"$f":"General!$H$2","v":"Fecha de Emisión: 2017/02/28"},{"$f":"General!$I$2","v":"IN-IV-F-14"}]
[null,null,null,{"$f":"General!$H$3","v":"Revision N°:\n2"},{"$f":"\"Página \"&A1&\" de \"&Dt_TPG","v":"Página 6 de 11"}]
[]
["9.-","Cronograma de actividades a desarrollar",null,null,{"$f":"Integrantes!J6","v":12},null,{"$f":"E5","v":12},"Meses Maximo","Palabras"]
[]
[null,"No","Descripción básica de la actividad","Mes de Inicio","Duración en mes",null,{"$f":"MAX(G8:G27)","v":0},"Meses de ejecición actuales",{"$f":"SUM(I8:I27)","v":0},"<== Total de palabras"]
[null,{"$f":"ROW()-7","v":1},null,null,null,null,{"$f":"SUM(D8:E8)","v":0},null,{"$f":"IF(C8=\"\",0,LEN(TRIM(C8))-LEN(SUBSTITUTE(TRIM(C8),\" \",\"\"))+1)","v":0}]
[null,{"$f":"ROW()-7","v":2},null,null,null,null,{"$f":"SUM(D9:E9)","v":0},null,{"$f":"IF(C9=\"\",0,LEN(TRIM(C9))-LEN(SUBSTITUTE(TRIM(C9),\" \",\"\"))+1)","v":0}]
[null,3,null,null,null,null,0,null,0]
{"$rows_left_out":24}
{"sheet":"Productos","index":7,"n_rows":60,"n_cols":21,"rows_kept":60,"cut":false,"hidden":false,"merged":[[1,1,2,5]]}
[7]
[null,"PRESENTACIÓN DE PROYECTOS \nDE INVESTIGACIÓN",null,null,null,null,{"$f":"General!$H$2","v":"Fecha de Emisión: 2017/02/28"},{"$f":"General!$I$2","v":"IN-IV-F-14"}]
[null,null,null,null,null,null,{"$f":"General!$H$3","v":"Revision N°:\n2"},{"$f":"\"Página \"&A1&\" de \"&Dt_TPG","v":"Página 7 de 11"},null,null,"N","Abreviatura","IdClase","INV","IMP","Clase ","Tipo de Productos","Indicadores","o","Ok"]
[null,null,null,null,null,null,{"$f":"IF(H5=\"INV\",3,4)","v":3},null,null,null,{"$f":"ROW()-3","v":1},"Articulo Q1","GNC",60,60,"Productos de Generación de Nuevo Conocimiento (GNC) ","En Cuartil 1 (Q1) de Scimago ","Comunicado sometido ante la editorial","o",{"$f":"SUMIFS($F$7:$F$27,$C$7:$C$27,$L4)","v":0}]
["10.-","Productividad comprometida",null,null,null,"Tipo de proyecto:",null,{"$f":"General!$H$1","v":"INV"},null,null,{"$f":"ROW()-3","v":2},"Articulo Q2","GNC",50,50,"Productos de Generación de Nuevo Conocimiento (GNC) ","En Cuartil 2 (Q2) de Scimago ","Comunicado sometido ante la editorial","o",{"$f":"SUMIFS($F$7:$F$27,$C$7:$C$27,$L5)","v":0}]
[null,"N°","Resultado/Producto esperado","Descripción o detalles del producto esperado","Indicador","Cantidad","Total de puntos","Benefi-ciario",null,null,3,"Articulo Q3","GNC",40,40,"Productos de Generación de Nuevo Conocimiento (GNC) ","En Cuartil 3 (Q3) de Scimago ","Comunicado sometido ante la editorial","o",0]
[null,{"$f":"ROW()-6","v":1},null,null,{"$f":"IFERROR(VLOOKUP($C7,L3:$T$40,7,0),\" \")","v":" "},1,{"$f":"IFERROR(F7*VLOOKUP($C7,$L$3:$T$40,G$4,0),\" \")","v":" "},null,null,null,4,"Articulo Q4","GNC",30,30,"Productos de Generación de Nuevo Conocimiento (GNC) ","En Cuartil 4 (Q4) de Scimago ","Comunicado sometido ante la editorial","o",0]
[null,{"$f":"ROW()-6","v":2},null,null,{"$f":"IFERROR(VLOOKUP($C8,L4:$T$40,7,0),\" \")","v":" "},1," ",null,null,null,5,"Articulo A1","GNC",20,20,"Productos de Generación de Nuevo Conocimiento (GNC) ","En A1  de  Publindex","Comunicado sometido ante la editorial","o",0]
[null,3,null,null,{"$f":"IFERROR(VLOOKUP($C9,L5:$T$40,7,0),\" \")","v":" "},1," ",null,null,null,6,"Articulo A2","GNC",16,16,"Productos de Generación de Nuevo Conocimiento (GNC) ","En A2  de  Publindex","Comunicado sometido ante la editorial","o",0]
[null,4,null,null,{"$f":"IFERROR(VLOOKUP($C10,L6:$T$40,7,0),\" \")","v":" "},0," ",null,null,null,7,"Articulo B","GNC",14,14,"Productos de Generación de Nuevo Conocimiento (GNC) ","En B  de  Publindex","Comunicado sometido ante la editorial","o",0]
{"$rows_left_out":51}
{"sheet":"Integrantes","index":8,"n_rows":38,"n_cols":27,"rows_kept":38,"cut":false,"hidden":false,"merged":[[24,25,24,26],[35,1,37,1],[20,1,22,1],[23,1,25,1],[26,1,28,1],[29,1,31,1],[32,1,34,1],[21,5,21,7],[24,5,24,7],[22,3,22,7],[25,3,25,7],[28,3,28,7],[37,3,37,7],[33,5,33,7],[36,5,36,7],[27,5,27,7],[11,1,13,1],[14,1,16,1],[17,1,19,1],[13,3,13,7],[16,3,16,7],[19,3,19,7],[2,1,3,4],[2,6,2,7],[3,6,3,7],[8,1,10,1],[9,5,9,7],[10,3,10,7],[30,5,30,7],[31,3,31,7],[34,3,34,7],[18,5,18,7],[12,5,12,7],[15,5,15,7]]}
[8]
[]
[null,"PRESENTACIÓN DE PROYECTOS \nDE INVESTIGACIÓN",null,null,null,{"$f":"General!$H$2","v":"Fecha de Emisión: 2017/02/28"},"IN-IV-F-14",null,null,null,null,null,"Ok","Puntos","IP Max","IP Min","CO Max","CO Min","CR"]
[null,null,null,null,null,{"$f":"General!$H$3","v":"Revision N°:\n2"},{"$f":"\"Página \"&A1&\" de \"&Dt_TPG","v":"Página 8 de 11"},{"$f":"\"Página \"&A2&\" de \"&Dt_TPG","v":"Página  de 11"},null,20,null,null,1,{"$f":"S8","v":0},{"$f":"VLOOKUP($M$4,$M$8:$T$23,3,0)","v":8},{"$f":"O4-4","v":4},{"$f":"O4/2","v":4},{"$f":"P4/2","v":2},{"$f":"VLOOKUP($M$4,$M$8:$T$23,2,0)","v":20},{"$f":"VLOOKUP($M$4,$M$8:$T$23,8,0)","v":25}]
[]
["11.-","Investigadores Integrantes del proyecto.",null,null,null,{"$f":"Cel_TP","v":"INV"},{"$f":"Cel_Fac","v":"NT"},{"$f":"V_Max","v":0},null,{"$f":"IF(F6=\"INV\",12,24)","v":12},null,null,null,null,null,null,null,null,null,null,null,null,"* Cuadro para tener relación entre Fincion y Tipo de Vinculo"]
[]
[null,"No","Identificacion","Nombres","Apellidos","Nivel Academico","Mes","Horas",null,"Max","Min",null,"Ok","Puntos","IP Max","IP Min","CO Max","CO Min",{"$f":"H6","v":0},"Valores",null,null,"Funcion ","y","Vinculo","Mes","Fila"]
[null,1,null,null,null,null,{"$f":"J6","v":12},null,null,{"$f":"O4","v":8},{"$f":"P4","v":4},"Doc. Carrera TC",{"$f":"IF(SUM(M10:M23)=0,1,IF(N9=S9,1,0))","v":1},20,8,4,4,2,{"$f":"INT(S8/20)*20","v":0},25,null,null,"Investigador Principal",{"$f":"$X$8&\"9:\"&$X$8&\"10\"","v":"y9:y10"},"Doc. Carrera TC",{"$f":"G9","v":12},{"$f":"ROW()","v":9}]
[null,null,"Funcion :","Investigador Principal",null,null,null,null,null,{"$f":"IFERROR(VLOOKUP($F10,V_IdNBC,2,0),0)","v":0},null,"Doc. Carrera MT",{"$f":"IF(N10=S10,1,0)","v":0},40,12,8,6,4,{"$f":"INT(S9/20)*20","v":0},50,null,null,"Investigador Principal",{"$f":"$X$8&\"9:\"&$X$8&\"10\"","v":"y9:y10"},"Doc. Carrera MT",{"$f":"Z9","v":12},{"$f":"ROW()","v":10}]
{"$rows_left_out":29}
{"sheet":"Presupuesto","index":9,"n_rows":125,"n_cols":17,"rows_kept":125,"cut":false,"hidden":false,"merged":[[66,4,66,5],[61,4,61,5],[62,4,62,5],[63,4,63,5],[64,4,64,5],[65,4,65,5],[56,4,56,5],[57,4,57,5],[58,4,58,5],[59,4,59,5],[60,4,60,5],[51,4,51,5],[52,4,52,5],[53,4,53,5],[54,4,54,5],[55,4,55,5],[122,4,123,8],[99,1,101,1],[102,1,104,1],[105,1,107,1],[108,1,110,1],[120,4,120,8],[96,1,98,1],[2,1,3,6],[48,4,48,5],[49,4,49,5],[93,1,95,1],[68,4,68,5],[67,4,67,5],[78,1,80,1],[81,1,83,1],[84,1,86,1],[87,1,89,1],[90,1,92,1],[6,3,6,8],[7,3,7,5],[7,7,7,8],[50,4,50,5]]}
[9]
[]
[null,"PRESENTACIÓN DE PROYECTOS \nDE INVESTIGACIÓN",null,null,null,null,null,{"$f":"General!$H$2","v":"Fecha de Emisión: 2017/02/28"},{"$f":"General!$I$2","v":"IN-IV-F-14"}]
[null,null,null,null,null,null,null,{"$f":"General!$H$3","v":"Revision N°:\n2"},{"$f":"\"Página \"&$A$1&\" de \"&Dt_TPG","v":"Página 9 de 11"}]
[]
[]
[null,"T","Título de la Propuesta :",{"$f":"General!B9","v":0}]
[null,"L","Lider responsable",{"$f":"General!C10","v":0},null,null,"Codigo VICEIN:"]
[]
["12.-","Presupuesto rubro personal asocidado a la propuesta",null,null,null,null,{"$f":"V_Max","v":0},{"$f":"Cel_TP","v":"INV"},{"$f":"Gp_Max","v":"NR"}]
{"$rows_left_out":116}
{"sheet":"Impactos","index":10,"n_rows":39,"n_cols":12,"rows_kept":39,"cut":false,"hidden":false,"merged":[[1,2,2,2]]}
[10,null,null,null,null,null,"*Pueden  Ocultar las Filas que no se utilicen."]
[null,null,"PRESENTACIÓN DE PROYECTOS \nDE INVESTIGACIÓN",{"$f":"General!$H$2","v":"Fecha de Emisión: 2017/02/28"},{"$f":"General!$I$2","v":"IN-IV-F-14"}]
[null,null,null,{"$f":"General!$H$3","v":"Revision N°:\n2"},{"$f":"\"Página \"&$A$1&\" de \"&Dt_TPG","v":"Página 10 de 11"},null,{"$f":"SUM(G7:G3500)","v":1},"<== Total de palabras"]
[]
["14.-","#","Impactos asociados a la propuesta.",null,null,null,"Largo"]
[]
[null,"N°","Impacto","Categoria","Plazo",null,{"$f":"IF(C7=\"\",0,LEN(TRIM(C7))-LEN(SUBSTITUTE(TRIM(C7),\" \",\"\"))+1)","v":1},null,null,"No","Tipo","Duración"]
[null,{"$f":"ROW()-7","v":1},null,null,null,null,{"$f":"IF(C8=\"\",0,LEN(TRIM(C8))-LEN(SUBSTITUTE(TRIM(C8),\" \",\"\"))+1)","v":0},null,null,1,"Fin de la pobreza","Corto (1 año)"]
[null,{"$f":"ROW()-7","v":2},null,null,null,null,0,null,null,{"$f":"J8+1","v":2},"Hambre Cero (0)","Medio (2 años)"]
[null,3,null,null,null,null,0,null,null,{"$f":"J9+1","v":3},"Salud y bienestar","Largo (3 años)"]
{"$rows_left_out":30}
{"sheet":"Bibliografía","index":11,"n_rows":39,"n_cols":8,"rows_kept":39,"cut":false,"hidden":false,"merged":[[34,2,34,4],[23,2,23,4],[24,2,24,4],[25,2,25,4],[26,2,26,4],[27,2,27,4],[28,2,28,4],[29,2,29,4],[30,2,30,4],[31,2,31,4],[32,2,32,4],[33,2,33,4],[22,2,22,4],[11,2,11,4],[12,2,12,4],[13,2,13,4],[14,2,14,4],[15,2,15,4],[16,2,16,4],[17,2,17,4],[18,2,18,4],[19,2,19,4],[20,2,20,4],[21,2,21,4],[10,2,10,4],[1,2,2,2],[6,2,6,4],[7,2,7,4],[8,2,8,4],[9,2,9,4]]}
[11,null,null,null,null,null,"*Pueden  Ocultar las Filas que no se utilicen."]
[null,null,"PRESENTACIÓN DE PROYECTOS \nDE INVESTIGACIÓN",{"$f":"General!$H$2","v":"Fecha de Emisión: 2017/02/28"},{"$f":"General!$I$2","v":"IN-IV-F-14"}]
[null,null,null,{"$f":"General!$H$3","v":"Revision N°:\n2"},{"$f":"\"Página \"&$A$1&\" de \"&Dt_TPG","v":"Página 11 de 11"},null,{"$f":"SUM(G7:G3500)","v":0},"<== Total de palabras"]
[]
["15.-","#","Bibliografía de la propuesta.",null,null,null,"Largo"]
[]
[null,{"$f":"ROW()-6","v":1},null,null,null,null,{"$f":"IF(C7=\"\",0,LEN(TRIM(C7))-LEN(SUBSTITUTE(TRIM(C7),\" \",\"\"))+1)","v":0}]
[null,{"$f":"ROW()-6","v":2},null,null,null,null,{"$f":"IF(C8=\"\",0,LEN(TRIM(C8))-LEN(SUBSTITUTE(TRIM(C8),\" \",\"\"))+1)","v":0}]
[null,3,null,null,null,null,0]
[null,4,null,null,null,null,0]
{"$rows_left_out":29}